{"text_format":"1","workbook":"xlsx","n_sheets":8,"sheets":["Version_Hinweise","Inhalt","Besonderheiten","Empfehlung","mehrtägig nach Pauschalen","mehrtägig mit Belegen","eintägig nach Pauschalen","Staatenübersicht"],"not_rendered":{"charts":0,"images":3,"macros":1,"external_links":6,"defined_names":35,"comments":2,"pivot_tables":0},"unopened":[],"bounds":{"document_bytes":16777216,"sheet_cells":100000,"rows_first":2000,"rows_last":500,"rows_between":2000,"halvings":0,"cell_chars":16384,"cell_head_chars":4096},"cells_cut":0,"cells_raw":0,"read":"whole","date_system":"1900"}

{"sheet":"Version_Hinweise","index":0,"n_rows":32,"n_cols":2,"rows_kept":32,"cut":false,"hidden":false,"merged":[[5,1,5,4],[16,1,16,2],[19,1,19,4],[0,1,0,2]]}
[null,"mehrtägige Auslandsreisen ab dem Jahr 2025\n- Version und Hinweise -"]
[]
[null,"1. Version"]
[null,"2025.0"]
[]
[null,"Vorliegen einer aktuelleren Version in der NWB Datenbank prüfen."]
[]
[null,"Bitte beachten Sie!"]
[null,"Nach dem Entwurf des Wachstumschancengesetzes ist beabsichtigt, die Beträge für die "]
[null,"Verpflegungsmehraufwendungen (Inland) ab dem 1.1.2024 zu erhöhen. Sobald das Gesetz im "]
[null,"Bundesgesetzblatt veröffentlicht wird, erfolgt eine Anpassung der entsprechenden Beträge. "]
[null,"Bis zu einer Neureglung behalten die bisherigen Beträge ihre Gültigkeit."]
[]
[null,"NWB JAAAD-55617"]
[]
[null,"2. Eingabefelder"]
[null,"Die Eingabefelder sind gelb hinterlegt."]
[]
[null,"3. Autoren"]
[null,"Dieses Berechnungsprogramm wird inhaltlich betreut von Karl-Hermann Eckert und Ronny Sebast."]
[]
[null,"4. Haftungsausschluss / AGB"]
[null,"Der NWB Verlag übernimmt keine Gewähr und keine Haftung für die Richtigkeit der Ergebnisse."]
[null,"Im Übrigen gelten die die aktuellen AGB der NWB Datenbank und des NWB Verlages."]
[null,"Alle Rechte vorbehalten. Vervielfältigungen nur mit Zustimmung des Verlages."]
[]
[null,"5. Kontakt"]
[null,"NWB Verlag GmbH & Co. KG"]
[null,"Eschstr. 22 · 44629 Herne"]
[null,"Fon 02323.141-900 · Fax 02323.141-123"]
[null,"E-Mail: info@nwb.de"]
[null,"Internet: www.nwb.de"]

{"sheet":"Inhalt","index":1,"n_rows":63,"n_cols":3,"rows_kept":63,"cut":false,"hidden":false,"merged":[[0,1,0,3],[44,2,44,3],[45,2,45,3],[36,1,36,3],[38,2,41,3],[42,2,42,3],[43,2,43,3]]}
[null,"Reisekostenabrechnung für Auslandsreisen ab dem Jahr 2025\n- Inhalt -"]
[]
[null,"Dieses Excel-Tool beinhaltet: "]
[]
[null,"Blatt \"Empfehlung\""]
[null,null,"Arbeitsempfehlung"]
[]
[null,"Blatt \"mehrtägig nach Pauschalen\""]
[null,null,"Blatt 3 bietet für den Arbeitgeber die Möglichkeit seine Reisekosten nach den "]
[null,null,"allgemeinen Pauschbeträgen geltend zu machen. Der gesonderten Vorlage "]
[null,null,"von Abrechnungsdokumenten bedarf es nicht. Es ist durch geeignete Meldungen, "]
[null,null,"sicherzustellen, dass neben der Erstattung kein zusätzlicher Werbungskostenabzug"]
[null,null,"geltend gemacht wird. Dies kann zum Beispiel durch Meldungen an das zuständige"]
[null,null,"Finanzamt oder durch entsprechende Eintragungen auf der elektronischen "]
[null,null,"Lohnsteuerabrechnung erfolgen."]
[]
[null,"Blatt \"mehrtägig mit Belegen\""]
[null,null,"Hinsichtlich der Abrechnung von Auslandsreisekosten mittels Blatt 4 bedarf es der "]
[null,null,"Vorlage von Einzelnachweisen."]
[null,null,"Dies kann der Fall sein, wenn die Unterkunft im Ausland durch den Arbeitgeber"]
[null,null,"auf dessen Namen erfolgte, die Bezahlung vor Ort aber durch den Arbeitnehmer"]
[null,null,"vorgenommen wurde. Wurde dem Arbeitnehmer neben der Unterkunft auch die  "]
[null,null,"Verpflegung unentgeltlich zur Verfügung gestellt, sind die entsprechenden Beträge"]
[null,null,"für Verpflegungsmehraufwendungen entsprechend zu kürzen."]
[]
[]
[null,"Blatt \"eintägig nach Pauschalen\""]
[null,null,"Hinsichtlich der Abrechnung von Auslandsreisekosten mittels Blatt 5 bedarf es der "]
[null,null,"Vorlage von Einzelnachweisen."]
[null,null,"Dies kann der Fall sein, wenn die Kosten für Verköstigung im Ausland durch den Arbeitgeber"]
[null,null,"auf dessen Namen erfolgte, die Bezahlung vor Ort aber durch den Arbeitnehmer"]
[null,null,"vorgenommen wurde. Wurde dem Arbeitnehmer die"]
[null,null,"Verpflegung unentgeltlich zur Verfügung gestellt, sind die entsprechenden Beträge"]
[null,null,"für Verpflegungsmehraufwendung entsprechend zu kürzen."]
[null,null,"Die Kürzung erfolgt durch Aktivierung der entsprechenden Schaltfläche [¨Kürzung]."]
[]
[null,"Hinweise:"]
[]
[null,null,"Bitte beachten Sie, dass das vorliegende Tool lediglich die Grundsätze der Reisekostenberechnung berücksichtigt. Das bedeutet, dass bei der Ermittlung der Aufwendungen für Verpflegung für die Versteuerung die Sachbezugswerte berücksichtigt werden. Eine Berücksichtigung durch den Arbeitgeber zur Verfügung gestellter Mahlzeiten mit dem Sachbezugswert ist bis zu einem Wert von 60,00 € je Mahlzeit möglich. \n\n"]
[]
[]
[]
[]
[null,null,"Übersteigt der Wert der zur Verfügung gestellten Mahlzeit den Wert von 60,00 € ist der tatsächliche Wert der "]
[null,null,"Mahlzeit als geldwerter Vorteil zu versteuern. Sofern keine Besteuerung der Sachbezugswerte erfolgt, "]
[null,null,"werden die gesetzlichen Pauschbeträge für Verpflegungsmehraufwendungen entsprechend der unentgeltlich "]
[null,null,"zur Verfügung gestellten Mahlzeiten gekürzt."]
[]
[null,null,"Die Grundlagen zur steuerlichen Behandlung von Reisekosten sind im BMF-Schreiben vom"]
[null,null,"25.11.2020 - IV C 5 - S 2353/19/10011 :006 (NWB EAAAH-65600) enthalten."]
[]
[null,null,"Aktuelle Entwicklungen, Zweifelsfragen und akute Fallstricke sind in einer Sonderausgabe des Verlags enthalten."]
[]
[null,null,"Hinweis:"]
[null,null,"Die hier hinterlegten Pauschbeträge für Auslandsreisen wurden durch BMF-Schreiben vom 02.12.2024 - IV C 5 - S 2353/19/10010 :006"]
[null,null,"(NAAAJ-81172) zur steuerlichen Behandlung von Reisekosten und Reisevergütungen bei betrieblich und beruflich "]
[null,null,"veranlassten Auslandsreisen ab dem 1. Januar 2024 bekanntgegeben."]
[]
[null,null,"Weitere rechtliche Hinweise enthalten die aktuellen Lohnsteuer-Richtlinien (LStR) bzw. Lohnsteuer-Hinweise (LStH)."]
[]
{"$rows_left_out":4}
{"sheet":"Besonderheiten","index":2,"n_rows":5,"n_cols":2,"rows_kept":5,"cut":false,"hidden":false,"merged":[[0,1,0,3],[2,1,2,3],[5,2,6,3],[8,2,9,3],[4,1,4,3],[3,1,3,3]]}
[null,"Reisekostenabrechnung für Auslandsreisen ab dem Jahr 2025\n- Allgemeine Grundsätze sowie Besonderheiten bei Flug- und Schiffsreisen -"]
[]
[null,"Für den Ansatz von Verpflegungsmehraufwendungen bei Auswärtstätigkeiten im Ausland gelten nach Staaten unterschiedliche Pauschbeträge, die vom Bundesministerium der Finanzen (BMF) im Einvernehmen mit den obersten Finanzbehörden der Länder auf der Grundlage der höchsten Auslandstagegelder nach dem Bundesreisekostengesetz (BRKG) bekannt gemacht werden. \nFür die im BMF-Schreiben nicht erfassten Staaten ist der für Luxemburg geltende Pauschbetrag maßgebend; für die im BMF-Schreiben nicht erfassten Übersee- und Außengebiete gilt der für das Mutterland geltende Pauschbetrag entsprechend. \n\nWerden an einem Kalendertag Auswärtstätigkeiten im In- und Ausland durchgeführt, ist für diesen Tag das entsprechende Auslandstagegeld des jeweiligen Staates maßgebend, selbst dann, wenn die überwiegende Zeit im Inland verbracht wurde.\n\nPauschbeträge am An- bzw. Rückreisetag \n\nBei eintägigen Reisen in das Ausland ist der entsprechende Pauschbetrag des letzten Tätigkeitsortes im Ausland maßgebend. \n\nBei mehrtägigen Reisen in verschiedenen Staaten gilt für die Ermittlung der Verpflegungspauschalen am An- und Abreisetag sowie an den Zwischentagen (Tage mit 24 Stunden Abwesenheit) gilt Folgendes:\n\n• Bei der Anreise vom Inland in das Ausland oder vom Ausland in das Inland jeweils ohne Tätigwerden ist der entsprechende\n   Pauschbetrag des Ortes maßgebend, der vor 24 Uhr Ortszeit erreicht wird.\n\n• Bei der Abreise vom Ausland in das Inland oder vom Inland in das Ausland ist der entsprechende Pauschbetrag des letzten\n   Tätigkeitsortes maßgebend. \n\n• Für die Zwischentage ist in der Regel der entsprechende Pauschbetrag des Ortes maßgebend, den die reisende Person \n   vor 24 Uhr Ortszeit erreicht hat.\n\n"]
[null,"Besonderheiten bei Schiffs- und Flugreisen \n\nBei Flugreisen gilt ein Staat in dem Zeitpunkt als erreicht, in dem das Flugzeug dort landet. Zwischenlandungen bleiben unberücksichtigt, es sei denn, dass durch sie Übernachtungen notwendig werden. Erstreckt sich eine Flugreise über mehr als zwei Kalendertage, ist für die Tage, die zwischen dem Tag des Abflugs und dem Tag der Landung liegen, das für Österreich geltende Tagegeld anzusetzen. Staaten, die überflogen werden, wirken sich nicht auf die Höhe der Verpflegungspauschale aus.\n\nMehrtätige Reisen sind zum Beispiel Flügen nach Fernost, Neuseeland oder Australien möglich. Für eine dreitägige Anreise müssten die Pauschbeträge für Verpflegung wie folgt berücksichtigt werden:\n\n    am Abflugtag:                die Verpflegungspauschale des Abreiselandes oder des Rückfluges,\n    am Zwischentag:           die für Österreich geltende Pauschale,\n    am Tag der Landung:    die Pauschale für das Land, in dem das Flugzeug gelandet ist.\n\nBei Schiffsreisen ist das für Luxemburg geltende Tagegeld zu berücksichtigen. Für das Personal auf deutschen Staatsschiffen sowie für das Personal auf Schiffen der Handelsmarine unter deutscher Flagge auf Hoher See gilt das Inlandstagegeld für die Bundesrepublik Deutschland. Für die Tage der Einschiffung und Ausschiffung ist das für den Hafenort geltende Tagegeld anzusetzen."]
[null,"Zeitverschiebungen während einer Reise werden nicht berücksichtigt, auch wenn dadurch Tage zu erfassen sind, die weniger als 24 Stunden oder länger als 24 Stunden dauern."]

{"sheet":"Empfehlung","index":3,"n_rows":10,"n_cols":3,"rows_kept":10,"cut":false,"hidden":false,"merged":[[9,2,10,3],[2,1,2,3],[6,2,7,3],[0,1,0,3]]}
[null,"Reisekostenabrechnung für Auslandsreisen ab dem Jahr 2025\n- Empfehlung -"]
[]
[null,"Es wird vorgeschlagen in dieser Excel-Mappe keine Einträge vorzunehmen."]
[]
[null,"Die Empfehlung lautet:"]
[]
[null,"*","Kopieren Sie diese Excel-Mappe unter einen neuen Namen über den Befehl \"Speichern unter\" (z. B.: \"Reisekosten\") auf Ihre Festplatte. "]
[]
[]
[null,"*","Weiterhin wird das Auswahlmenü für die verschiedenen Länder automatisch vergrößert, wenn das entsprechende Auswahlfeld markiert wird. Durch Auswahl eines anderen hellmarkierten Feldes wird die ursprüngliche Darstellung wieder hergestellt."]

{"sheet":"mehrtägig nach Pauschalen","index":4,"n_rows":75,"n_cols":14,"rows_kept":75,"cut":false,"hidden":false,"merged":[[68,6,68,7],[0,1,0,11],[24,1,24,2],[41,1,41,2],[55,1,55,2],[59,1,59,4],[16,2,16,9],[17,2,17,9],[21,2,21,5],[51,2,51,4],[16,1,17,1],[57,1,57,4],[3,2,3,9],[8,2,8,3],[11,2,11,3],[13,2,13,3],[5,2,5,9],[64,6,64,7],[66,6,66,7],[35,1,35,2]]}
[null,"mehrtägige Auslandsreisen ab dem Jahr 2025\n- nach Pauschalen -"]
[]
[]
[null,"Name des/der Reisenden"]
[]
[null,"Reiseland"]
[]
[]
[null,null,"Datum",null,null,"Uhrzeit",null,"Reisedauer"]
[]
[]
[null,"Abreise",null,null,null,null,null,null,"Gesamtdauer in Tagen",{"$f":"IF(C12=\"\",\"\",SUM(C14-C12+1))","v":""},null,null,null," "]
[null,null,null,null,null,null,null,null,null,null,null,null,null," "]
[null,"Rückkehr",null,null,null,null,null,null,null,null,null,null,null," "]
[]
[]
[null,"Grund und Ort der Reise"]
[]
[]
[]
[]
[null,null,"Reisekostenabrechnung",null,null,null,null,null,null,"Euro",null,"Konto"]
[]
[]
[null,"Pauschale für Mehraufwand für Verpflegung"]
[]
[null,"volle Reisetage = Tagessatz",null,{"$f":"IF(C6=\"\",\"\",(J12-2))","v":""},"Tag/e","zu",{"$f":"IF(C6=\"\",\"\",IF(ISNA(VLOOKUP(C6,Staatenübersicht!A9:E253,2,FALSE)) = TRUE, \"Nichtsgefunden\", VLOOKUP(C6,Staatenübersicht!A9:E253,2,FALSE)))","v":""},{"$f":"IF(C12=\"\",\"0,00 €\",(D27*G27))","v":"0,00 €"}]
[]
[null,"erster Reisetag",null,{"$f":"IF(C6=\"\",\"\",1)","v":""},"Tag/e","zu",{"$f":"IF(C6=\"\",\"\",IF(ISNA(VLOOKUP(C6,Staatenübersicht!A9:E253,3,FALSE)) = TRUE, \"Nichtsgefunden\", VLOOKUP(C6,Staatenübersicht!A9:E253,3,FALSE)))","v":""},{"$f":"IF(C12=\"\",\"0,00 €\",D29*G29)","v":"0,00 €"}]
[]
[null,"letzter Reisetag",null,{"$f":"IF(C6=\"\",\"\",1)","v":""},"Tag/e","zu ",{"$f":"IF(C6=\"\",\"\",IF(ISNA(VLOOKUP(C6,Staatenübersicht!A9:E253,3,FALSE)) = TRUE, \"Nichtsgefunden\", VLOOKUP(C6,Staatenübersicht!A9:E253,3,FALSE)))","v":""},{"$f":"IF(C12=\"\",\"0,00 €\",+D31*G31)","v":"0,00 €"}]
[null,null,null,null,null,null,null,null,null,{"$f":"IF(J12<\"0\",SUM(H27+H29+H31),\"0,00 €\")","v":0}]
[]
[]
[]
[null,"Übernachtungskosten (Pauschale nur für Arbeitnehmer)"]
[]
[null,"Pauschale für Arbeitnehmer bei Erstattung durch Arbeitgeber",null,null,"Tag/e","zu ",{"$f":"IF(C6=\"\",\"\",IF(ISNA(VLOOKUP(C6,Staatenübersicht!A9:E253,5,FALSE)) = TRUE, \"Nichtsgefunden\", VLOOKUP(C6,Staatenübersicht!A9:E253,5,FALSE)))","v":""},{"$f":"IF(D38=\"\",\"\",+D38*G38)","v":""},null,{"$f":"+H38","v":""}]
[]
[]
[]
[null,"Beförderungskosten"]
[]
[null,"mit eigenem Fahrzeug",null,null,"km","zu ",0.3,{"$f":"+D44*G44","v":0}]
[]
[null,"mit Bahn ",null,null,null,null,"lt. Einzelnachweis"]
[null,null,null,null,null,null,null," "]
[null,"mit Taxi ",null,null,null,null,"lt. Einzelnachweis"]
[]
[null,"mit Flugzeug",null,null,null,null,"lt. Einzelnachweis"]
[]
[null,"Sonstiges",null,null,null,null,"lt. Einzelnachweis",null,null,{"$f":"+H44+H46+H48+H50+H52","v":0}]
[]
[]
[]
[null,"sonstige Aufwendungen"]
[]
[null,null,null,null,null,null,"lt. Einzelnachweis"]
[null,null," "]
[null,null,null,null,null,null,"lt. Einzelnachweis",null,null,{"$f":"+H58+H60","v":0}]
{"$rows_left_out":16}
{"sheet":"mehrtägig mit Belegen","index":5,"n_rows":127,"n_cols":20,"rows_kept":127,"cut":false,"hidden":false,"merged":[[68,6,68,7],[3,3,3,10],[8,3,8,4],[11,3,11,4],[13,3,13,4],[5,3,5,10],[64,2,64,5],[46,2,46,3],[60,2,60,3],[68,2,68,3],[68,4,68,5],[116,7,116,8],[118,7,118,8],[120,7,120,8],[0,2,0,12],[24,2,24,3],[35,2,35,3],[35,4,35,5],[35,6,35,7],[111,2,111,5],[16,3,16,10],[17,3,17,10],[21,3,21,6],[56,3,56,5],[16,2,17,2],[103,2,103,8],[62,2,62,5]]}
[null,null,"mehrtägige Auslandsreisen ab dem Jahr 2025\n- mit Belegen -"]
[]
[]
[null,null,"Name des/der Reisenden"]
[]
[null,null,"Reiseland"]
[]
[]
[null,null,null,"Datum",null,null,"Uhrzeit",null,"Reisedauer"]
[]
[]
[null,null,"Abreise",null,null,null,null,null,null,"Gesamtdauer in Tagen",{"$f":"IF(D12=\"\",\"\",SUM(D14-D12+1))","v":""},null,null,null," "]
[null,null,null,null,null,null,null,null,null,null,null,null,null,null," "]
[null,null,"Rückkehr",null,null,null,null,null,null,null,null,null,null,null," "]
[]
[]
[null,null,"Grund und Ort der Reise"]
[]
[]
[]
[]
[null,null,null,"Reisekostenabrechnung",null,null,null,null,null,null,"Euro",null,"Konto"]
[]
[]
[null,null,"Pauschale für Mehraufwand für Verpflegung"]
[]
[null,null,"volle Reisetage = Tagessatz","24 Stunden ",{"$f":"IF(D6=\"\",\"\",(K12-2))","v":""},"Tag/e","zu",{"$f":"IF(D6=\"\",\"\",IF(ISNA(VLOOKUP(D6,Staatenübersicht!A9:E253,2,FALSE)) = TRUE, \"Nichtsgefunden\", VLOOKUP(D6,Staatenübersicht!A9:E253,2,FALSE)))","v":""},{"$f":"IF(D12=\"\",\"0,00 €\",(E27*H27))","v":"0,00 €"}]
[]
[null,null,"erster Reisetag",null,{"$f":"IF(D6=\"\",\"\",1)","v":""},"Tag/e","zu",{"$f":"IF(D6=\"\",\"\",IF(ISNA(VLOOKUP(D6,Staatenübersicht!A9:E253,4,FALSE)) = TRUE, \"Nichtsgefunden\", VLOOKUP(D6,Staatenübersicht!A9:E253,3,FALSE)))","v":""},{"$f":"IF(D12=\"\",\"0,00 €\",E29*H29)","v":"0,00 €"}]
[]
[null,null,"letzter Reisetag",null,{"$f":"IF(D6=\"\",\"\",1)","v":""},"Tag/e","zu ",{"$f":"IF(D6=\"\",\"\",IF(ISNA(VLOOKUP(D6,Staatenübersicht!A9:E253,3,FALSE)) = TRUE, \"Nichtsgefunden\", VLOOKUP(D6,Staatenübersicht!A9:E253,3,FALSE)))","v":""},{"$f":"IF(D12=\"\",\"0,00 €\",+E31*H31)","v":"0,00 €"}]
[null,null,null,null,null,null,null,null,null,null,{"$f":"IF(K12<\"0\",SUM(I27+I29+I31),\"0,00 €\")","v":0}]
[]
[]
[]
[null,null,"Übernachtungskosten "]
[]
[null,null,"Übernachtung mit Frühstück (nicht gesondert ausgewiesen)",null,null,"Tag/e","zu",null,{"$f":"+E38*H38","v":0}]
[]
[null,null,"Übernachtung mit Frühstück (Wert ohne Frühstück) ",null,null,"Tag/e","zu ",null,{"$f":"+E40*H40","v":0}]
[null,null,"zuzüglich Frühstück - Frühstück gesondert ausgewiesen -",null,{"$f":"+E40","v":0},"Tag/e","zu ",null,{"$f":"+E41*H41","v":0}]
[]
[null,null,"Übernachtung ohne Frühstück",null,null,"Tag/e","zu ",null,{"$f":"+E43*H43","v":0},null,{"$f":"SUM(I38:I43)","v":0}]
[]
[]
[]
[null,null,"Beförderungskosten"]
[]
[null,null,"mit eigenem Fahrzeug",null,null,"km","zu ",null,{"$f":"+E49*H49","v":0}]
[]
[null,null,"mit Bahn ",null,null,null,null,"lt. Einzelnachweis"]
[null,null,null,null,null,null,null,null," "]
[null,null,"mit Taxi ",null,null,null,null,"lt. Einzelnachweis"]
[]
[null,null,"mit Flugzeug",null,null,null,null,"lt. Einzelnachweis"]
[]
[null,null,"sonstiges",null,null,null,null,"lt. Einzelnachweis",null,null,{"$f":"+I49+I51+I53+I55+I57","v":0}]
[]
[]
[]
{"$rows_left_out":68}
{"sheet":"eintägig nach Pauschalen","index":6,"n_rows":87,"n_cols":18,"rows_kept":87,"cut":false,"hidden":false,"merged":[[3,2,3,9],[8,2,8,3],[11,2,11,3],[13,2,13,3],[5,2,5,9],[54,2,54,4],[17,2,17,9],[21,2,21,5],[44,1,44,2],[58,1,58,2],[74,6,74,7],[76,6,76,7],[78,6,78,7],[0,1,0,11],[32,1,32,6],[24,1,24,2],[16,1,17,1],[65,1,65,7],[34,4,34,5],[34,6,34,7],[36,6,36,7],[37,6,37,7],[35,6,35,7],[60,1,60,4],[62,1,62,4],[16,2,16,9]]}
[null,"eintägige Auslandsreisen ab dem Jahr 2025\n- nach Pauschalen -"]
[]
[]
[null,"Name des/der Reisenden"]
[]
[null,"Reiseland"]
[]
[]
[null,null,"Datum",null,null,"Uhrzeit",null,"Reisedauer"]
[]
[]
[null,"Abreise",null,null,null,null,null,null,"Gesamtdauer in Stunden",{"$f":"IF(F14=\"\",\"\",F14-F12)","v":""},null,null,null," "]
[null,null,null,null,null,null,null,null,null,null,null,null,null," "]
[null,"Rückkehr",{"$f":"IF(C12=\"\",\"\",C12)","v":""},null,null,null,null,null,null,null,null,null,null," "]
[]
[]
[null,"Grund und Ort der Reise"]
[]
[]
[]
[]
[null,null,"Reisekostenabrechnung",null,null,null,null,null,null,"Euro",null,"Konto"]
[]
[]
[null,"Pauschale für Mehraufwand für Verpflegung"]
[]
[]
[null,"Reisedauer","mehr als 8 Stunden",{"$f":"IF(J12=\"\",\"0\",IF(J12>0.33334,1,\"0\"))","v":"0"},null,"zu ",{"$f":"IF(C6=\"\",\"\",IF(ISNA(VLOOKUP(C6,Staatenübersicht!A9:E253,3,FALSE)) = TRUE, \"Nichtsgefunden\", VLOOKUP(C6,Staatenübersicht!A9:E253,3,FALSE)))","v":""},{"$f":"IF(C12=\"\",\"0,00 €\",D28*G28)","v":"0,00 €"}]
[null,null,null,null,null,null,null,null,null,{"$f":"IF(C12<>\"\",SUM(H28*D28),\"0,00 €\")","v":"0,00 €"}]
[{"$f":"IF(D4=\"\",\"\",IF(+K12<0.6667,1,0))","v":""}]
[]
[]
[null,"Kürzung wegen Verköstigung durch den Arbeitgeber (entsprechende Mahlzeit durch Häkchen markieren)"]
[]
[null,null,null,null,"Kürzungsbetrag",null,"Zuzahlung des AN"]
[null,"für Frühstück ",0.2,null,null,{"$f":"IF(R36=TRUE,Q36,\"0,00 €\")","v":"0,00 €"},null,null,null,null,null,null,null,{"$f":"IF(Q66=\"Wahr\",H68,\"0,00\")","v":"0,00"},{"$f":"MAX(F36-G36,\"0,00 €\")","v":0},{"$f":"IF(C6=\"\",\"\",IF(ISNA(VLOOKUP(C6,Staatenübersicht!A9:E253,2,FALSE)) = TRUE, \"Nichtsgefunden\", VLOOKUP(C6,Staatenübersicht!A9:E253,2,FALSE)))","v":""},{"$f":"P36*C36","v":{"$error":"#VALUE!"}},false]
[null,"für Mittagessen",0.4,null,null,{"$f":"IF(R37=TRUE,Q37,\"0,00 €\")","v":"0,00 €"},null,null,null,null,null,null,null,{"$f":"IF(Q66=\"Wahr\",+H69,\"0,00\")","v":"0,00"},{"$f":"MAX(F37-G37,\"0,00 €\")","v":0},{"$f":"IF(C6=\"\",\"\",IF(ISNA(VLOOKUP(C6,Staatenübersicht!A9:E253,2,FALSE)) = TRUE, \"Nichtsgefunden\", VLOOKUP(C6,Staatenübersicht!A9:E253,2,FALSE)))","v":""},{"$f":"P37*C37","v":{"$error":"#VALUE!"}},false]
[null,"für Abendessen",0.4,null,null,{"$f":"IF(R38=TRUE,Q38,\"0,00 €\")","v":"0,00 €"},null,null,null,{"$f":"MIN(-Q47,MAX(0))","v":0},null,null,null,{"$f":"IF(Q66=\"Falsch\",H70,\"0,00\")","v":"0,00"},{"$f":"MAX(F38-G38,\"0,00 €\")","v":0},{"$f":"IF(C6=\"\",\"\",IF(ISNA(VLOOKUP(C6,Staatenübersicht!A9:E253,2,FALSE)) = TRUE, \"Nichtsgefunden\", VLOOKUP(C6,Staatenübersicht!A9:E253,2,FALSE)))","v":""},{"$f":"P38*C38","v":{"$error":"#VALUE!"}},false]
[]
[null,null,null,null,null,null,null,null,null,null,null,null,null,"1.Bedingung","2.Bedingung","Summe"]
[null,{"$f":"IF(Q66=FALSE,\"\",\"Die Kürzungsbeträge werden um die verrechneten Sachbezugswerte gemindert\")","v":""},null,null,null,null,null,null,null,{"$f":"IF(B41=\"\",\"\",H72)","v":""},null,null,null,{"$f":"IF(Q66=TRUE,1,0)","v":0},{"$f":"IF(J38<0,1)","v":false},{"$f":"N41+O41","v":0}]
[]
[null,null,null,null,null,null,null,null,null,null,{"$f":"-H43","v":0}]
[]
[null,"Beförderungskosten"]
[]
[null,"mit eigenem Fahrzeug",null,null,"km","zu ",0.3,{"$f":"+D47*G47","v":0},null,null,null,null,null,null,null,{"$f":"IF(Q66=FALSE,(O36+O37+O38),(O36+O37+O38))","v":0},{"$f":"MIN(P47,MAX(H28))","v":0}]
[]
[null,"mit Bahn ",null,null,null,null,"lt. Einzelnachweis"]
[null,null,null,null,null,null,null," "]
[null,"mit Taxi ",null,null,null,null,"lt. Einzelnachweis"]
[]
[null,"mit Flugzeug",null,null,null,null,"lt. Einzelnachweis"]
[]
[null,"sonstiges",null,null,null,null,"lt. Einzelnachweis",null,null,{"$f":"+H47+H49+H51+H53+H55","v":0}]
[]
[]
[]
[null,"sonstige Aufwendungen"]
[]
{"$rows_left_out":28}
{"sheet":"Staatenübersicht","index":7,"n_rows":253,"n_cols":5,"rows_kept":253,"cut":false,"hidden":true,"merged":[[0,0,7,0],[0,1,0,3],[1,1,1,3],[2,1,2,3]]}
["Land","Pauschbeträge für Verpflegungsmehr-",null,null,"Pauschbetrag"]
[null,"aufwendungen bei einer",null,null,"für Übernach-"]
[null,"Abwesenheitsdauer je Kalendertag von",null,null,"tungskosten"]
[null,"mindestens","weniger als","weniger als"]
[null,"24 Stunden","24, aber","14, aber"]
[null,null,"mindestens","mindestens"]
[null,null,"14 Stunden","8 Stunden"]
[null,"€","€","€","€"]
["Afghanistan",30,20,95,95]
["Ägypten",50,33,125,112]
["Äthiopien",44,29,130,159]
["Äquatorialguinea",42,28,166,166]
["Albanien",27,18,113,112]
["Algerien",47,32,173,120]
["Andorra",41,28,45,91]
["Angola",40,27,299,368]
["Argentinien",35,24,113,113]
["Armenien",29,20,59,107]
["Aserbaidschan",44,29,72,88]
["Australien"]
["–        Canberra",74,49,158,186]
["–        Sydney",57,38,184,173]
["–        Australien im Übrigen",57,38,158,173]
["Bahrain",48,32,180,153]
["Bangladesch",46,31,165,189]
["Barbados",54,36,165,206]
["Belgien",59,40,135,141]
["Benin",40,27,115,168]
["Bhutan",27,18,null,176]
["Bolivien",46,31,93,108]
["Bosnien und Herzegowina",23,16,75,75]
["Botsuana",46,31,102,176]
["Brasilien"]
["–        Brasilia",51,34,127,88]
["–        Rio de Janeiro",69,46,145,140]
["–        Sao Paulo",46,31,132,151]
["–        Brasilien im Übrigen",46,31,84,88]
["Brunei",45,30,106,110]
["Bulgarien",22,15,115,115]
["Burkina Faso",38,25,174,174]
["Burundi",36,24,98,138]
["Chile",44,29,187,154]
["China"]
["–        Chengdu",41,28,105,131]
["–        Hongkong",71,48,145,169]
["–        Kanton",36,24,113,150]
["–        Peking",30,20,142,185]
["–        Shanghai",58,39,128,217]
["–        China im Übrigen",48,32,78,112]
["Costa Rica",60,40,93,127]
["Côte d’Ivoire",59,40,146,166]
["Deutschland",28,14,20,20]
["Dänemark",75,50,143,183]
["Dominikanische Republik",50,33,147,167]
["Dschibuti",77,52,305,255]
["Ecuador",27,18,97,103]
["El Salvador",65,44,119,161]
["Eritrea",46,31,91,78]
["Estland",29,20,85,85]
["Fidschi",32,21,69,183]
{"$rows_left_out":193}