{"text_format":"1","workbook":"xlsx","n_sheets":4,"sheets":["Hinweise + Impressum","Erläuterungen","Berechnung","Staatenübersicht"],"not_rendered":{"charts":0,"images":4,"macros":1,"external_links":2,"defined_names":16,"comments":1,"pivot_tables":0},"unopened":[],"bounds":{"document_bytes":16777216,"sheet_cells":100000,"rows_first":2000,"rows_last":500,"rows_between":2000,"halvings":0,"cell_chars":16384,"cell_head_chars":4096},"cells_cut":0,"cells_raw":0,"read":"whole","date_system":"1900"}

{"sheet":"Hinweise + Impressum","index":0,"n_rows":38,"n_cols":2,"rows_kept":38,"cut":false,"hidden":false,"merged":[[16,1,16,2]]}
[null,"Allgemeine Hinweise"]
[]
[null,"Versionshinweis"]
[]
[null,"Stand 2019"]
[null,"Version 2019.0"]
[null,"Zum Dokument in der Datenbank"]
[]
[null,"Haftungsausschluss / AGB"]
[]
[null,"Der NWB Verlag übernimmt keine Gewähr und keine Haftung für die Richtigkeit der Ergebnisse."]
[]
[null,"Im Übrigen gelten die die aktuellen AGB der NWB Datenbank und des NWB Verlages."]
[]
[null,"Autoren"]
[]
[null,"Karl-Hermann Eckert\nRonny Sebast"]
[]
[null,"Impressum"]
[]
{"$rows_left_out":19}
{"sheet":"Erläuterungen","index":1,"n_rows":79,"n_cols":4,"rows_kept":79,"cut":false,"hidden":false,"merged":[[3,2,3,5],[69,3,69,6]]}
[]
[]
[]
[]
[]
[]
[]
[]
[null,null,null,"Mit diesem Berechnungstool haben Sie die Möglichkeit, die Aufwendungen für eine Auslandsdienstreise mit mehreren aufeinanderfolgenden "]
[null,null,null,"unterschiedlichen Orten zu berechnen."]
[]
[null,null,null,"Grundlage für die Berechnung sind die Vorschriften des Einkommensteuergesetzes bzw. der einschlägigen Verwaltungsanweisungen. "]
[]
[null,null,null,"Bei Reisen vom Inland in das Ausland bestimmt sich der Pauschbetrag für die Verpflegungsmehraufwendungen und mögliche Übernachtungskosten"]
[null,null,null,"nach dem Ort, den der Reisende vor 24.00 Uhr Ortszeit erreicht hat. "]
[null,null,null,"Für Rückreisetage aus dem Ausland in das Inland ist der Pauschbetrag des letzten Tätigkeitsortes maßgebend."]
[]
[null,null,null,"Für eintägige Reisen in das Ausland steht ein separates Berechnungsprogramm zur Verfügung: NWB Datenbank DokID JAAAE-82626."]
[]
[null,null,null,"Sie haben die Möglichkeit, mit dem Modul, nahtlos aufeinanderfolgende Dienstreisen zu erfassen. "]
{"$rows_left_out":60}
{"sheet":"Berechnung","index":2,"n_rows":45,"n_cols":57,"rows_kept":45,"cut":false,"hidden":false,"merged":[[7,48,7,50],[29,5,29,6],[31,5,31,9],[7,26,7,27],[7,22,7,23],[7,30,7,31],[7,35,7,36],[33,5,33,9],[5,6,5,11],[7,5,7,7],[7,9,7,11],[7,39,7,41]]}
[]
[]
[]
[]
[]
[null,null,null,null,null,"Name"]
[null,null,null,null,null,null,null,null,null,null,null,null,null,null,null,null,"Hilfsspalte",null,"Hilfsspalte",null,"Hilfsspalte","Hilfsspalte","Hilfsspalte","Hilfsspalte",null,"Hilfsspalte","Hilfsspalte","Hilfsspalte","Hilfsspalte",null,"Hilfsspalte","Hilfsspalte","Hilfsspalte",null,null,null,null,"Hilfsspalte",null,null,null,null,"Hilfsspalte","Hilfsspalte","Hilfsspalte","Hilfsspalte",null,null,null,null,null,"Hilfsspalte"]
[null,null,null,null,null,"Beginn der Reise bzw. des \njeweiligen Reiseabschnittes",null,null,null,"Ende der Reise bzw. des\njeweiligen Reiseabschnittes",null,null,"\n\nTage",null,"Zweck der Reise","Aufenthaltsort/Land \njeweils vor 24.00 Uhr"," Tage\n",null,"erster",null,"letzter",null,"volle Tage",null,null,null,"erster Tag",null,"\"1 = gleiches Datum\"","gleiche Uhrzeit","letzter Tag",null,"Summe Verpflegung\n","Summe Verpflegungs- mehraufwand",null,"Pauschale für \nÜbernachtungs- kosten",null,null,null,"Kürzung wegen Verköstigung \n(Beachten Sie bitte den Kommentar!)",null,null,"volle Tage",null,"Summe",null,"Kürzungs- betrag\n",null,"Fahrtkosten\n",null,null,null,null,"sonstige Kosten Bezeichnung","sonstige Kosten\nBetrag",null,"Summe\n"]
["Datum","Uhrzeit","Wichtig",null,null,"am","um","von",null,"am","um","nach",null,null,null,null,null,null,"Reisetag ",null,"Reisetag",null,"tage","24 h ",null,null,"tage","14 h bis 24 h",null,null,"tage","14 h bis 24 h",null,null,null,"Tage","Tagessatz",null,null,"F = Tage","M = Tage","A = Tage","24 h ","F","M","A",null,null,"km","Betrag","Summe"]
[]
[null,null,null,null,null,null,null,null,null,null,null,null,{"$f":"IF(F11=\"\",\"\",Q11)","v":""},null,null,null,{"$f":"IF(F11=\"\",\"\",SUM(J11-F11+1))","v":""},null,{"$f":"1440-G11","v":1440},null,{"$f":"+K11","v":"00:00:00"},null,{"$f":"IF($G$11=\"\",\"\",IF(C12=\"WAHR\",(Q11-2),(Q11-2)))","v":""},{"$f":"IF(P11=\"\",\"\",IF(ISNA(VLOOKUP(P11,Staatenübersicht!$A$9:$E$264,2,FALSE))=TRUE,\"Nichtsgefunden\",VLOOKUP(P11,Staatenübersicht!$A$9:$E$264,2,FALSE)))*W11","v":{"$error":"#VALUE!"}},null,null,{"$f":"IF($G$11=\"\",\"\",IF(+G11,1,0))","v":""},{"$f":"IF($G$11=\"\",\"\",IF(ISNA(VLOOKUP(P11,Staatenübersicht!$A$9:$E$264,3,FALSE))=TRUE,\"Nichtsgefunden\",VLOOKUP(P11,Staatenübersicht!$A$9:$E$264,3,FALSE)))*AA11","v":{"$error":"#VALUE!"}},{"$f":"IF(F12=J11,\"1\",\"0\")","v":"1"},"1",{"$f":"IF(+G12,IF(AC11+AD11<2,\"1\",0),1)","v":1},{"$f":"IF($G$11=\"\",\"\",IF(ISNA(VLOOKUP(P11,Staatenübersicht!$A$9:$E$264,3,FALSE))=TRUE,\"Nichtsgefunden\",VLOOKUP(P11,Staatenübersicht!$A$9:$E$264,3,FALSE)))*AE11","v":{"$error":"#VALUE!"}},{"$f":"IF(Q11=\"\",\"\",IF(C11=\"WAHR\",X11+AF11,IF(C12=\"Wahr\",X11+AB11,X11+AB11+AF11)))","v":""},{"$f":"AG11","v":""},null,null,{"$f":"IF($G$11=\"\",\"\",IF(ISNA(VLOOKUP(P11,Staatenübersicht!$A$9:$E$264,5,FALSE))=TRUE,\"0,00 €\",VLOOKUP(P11,Staatenübersicht!$A$9:$E$264,5,FALSE)))","v":""},{"$f":"IF(AJ11=\"\",\"0,00 €\",AJ11*AK11)","v":"0,00 €"},null,null,null,null,{"$f":"IF(P11=\"\",\"\",IF(ISNA(VLOOKUP(P11,Staatenübersicht!$A$9:$E$264,2,FALSE))=TRUE,\"Nichtsgefunden\",VLOOKUP(P11,Staatenübersicht!$A$9:$E$264,2,FALSE)))","v":""},{"$f":"IF(F11=\"\",\"\",(-AQ11*0.2)*AN11)","v":""},{"$f":"IF(F11=\"\",\"\",(-AQ11*0.4)*AO11)","v":""},{"$f":"IF(F11=\"\",\"\",(-AQ11*0.4)*AP11)","v":""},{"$f":"IF(F11=\"\",\"\",(AR11+AS11+AT11))","v":""},null,null,0.3,{"$f":"IF(AW11=\"\",\"\",AW11*AX11)","v":""},{"$f":"IF(AY11=\"\",\"0,00 €\",AY11)","v":"0,00 €"},null,null,null,null,{"$f":"IF(F11=\"\",\"\",AH11+AL11+AZ11+BC11+AU11)","v":""}]
[{"$f":"(IF(J11=F12,\"WAHR\",\"FALSCH\"))","v":"WAHR"},{"$f":"(IF(K11=G12,\"WAHR\",\"FALSCH\"))","v":"WAHR"},{"$f":"IF(F12=\"\",\"\",(IF(OR(A12=\"FALSCH\",B12=\"FALSCH\"),\"FALSCH\",\"WAHR\")))","v":""},null,null,null,null,null,null,null,null,null,"",null,null,null,"",null,1440,null,"00:00:00",null,{"$f":"IF($G$11=\"\",\"\",IF(C12=\"WAHR\",(Q12-1),(Q12-2)))","v":""},{"$f":"IF(P12=\"\",\"\",IF(ISNA(VLOOKUP(P12,Staatenübersicht!$A$9:$E$264,2,FALSE))=TRUE,\"Nichtsgefunden\",VLOOKUP(P12,Staatenübersicht!$A$9:$E$264,2,FALSE)))*W12","v":{"$error":"#VALUE!"}},null,null,"",{"$f":"IF($G$11=\"\",\"\",IF(ISNA(VLOOKUP(P12,Staatenübersicht!$A$9:$E$264,3,FALSE))=TRUE,\"Nichtsgefunden\",VLOOKUP(P12,Staatenübersicht!$A$9:$E$264,3,FALSE)))*AA12","v":{"$error":"#VALUE!"}},"1","1",{"$f":"IF(+G13,IF(AC12+AD12<2,\"1\",0),1)","v":1},{"$f":"IF($G$11=\"\",\"\",IF(ISNA(VLOOKUP(P12,Staatenübersicht!$A$9:$E$264,3,FALSE))=TRUE,\"Nichtsgefunden\",VLOOKUP(P12,Staatenübersicht!$A$9:$E$264,3,FALSE)))*AE12","v":{"$error":"#VALUE!"}},{"$f":"IF(Q12=\"\",\"\",IF(C12=\"WAHR\",X12+AF12,IF(C13=\"Wahr\",X12+AF12,X12+AB12+AF12)))","v":""},"",null,null,{"$f":"IF($G$11=\"\",\"\",IF(ISNA(VLOOKUP(P12,Staatenübersicht!$A$9:$E$264,5,FALSE))=TRUE,\"0,00 €\",VLOOKUP(P12,Staatenübersicht!$A$9:$E$264,5,FALSE)))","v":""},"0,00 €",null,null,null,null,{"$f":"IF(P12=\"\",\"\",IF(ISNA(VLOOKUP(P12,Staatenübersicht!$A$9:$E$264,2,FALSE))=TRUE,\"Nichtsgefunden\",VLOOKUP(P12,Staatenübersicht!$A$9:$E$264,2,FALSE)))","v":""},"","","","",null,null,0.3,{"$f":"IF(AW12=\"\",\"\",AW12*AX12)","v":""},{"$f":"IF(AY12=\"\",\"0,00 €\",AY12)","v":"0,00 €"},null,null,null,null,{"$f":"IF(F12=\"\",\"\",AH12+AL12+AZ12+BC12+AU12)","v":""}]
["WAHR","WAHR","",null,null,null,null,null,null,null,null,null,"",null,null,null,"",null,1440,null,"00:00:00",null,"",{"$f":"IF(P13=\"\",\"\",IF(ISNA(VLOOKUP(P13,Staatenübersicht!$A$9:$E$264,2,FALSE))=TRUE,\"Nichtsgefunden\",VLOOKUP(P13,Staatenübersicht!$A$9:$E$264,2,FALSE)))*W13","v":{"$error":"#VALUE!"}},null,null,"",{"$f":"IF($G$11=\"\",\"\",IF(ISNA(VLOOKUP(P13,Staatenübersicht!$A$9:$E$264,3,FALSE))=TRUE,\"Nichtsgefunden\",VLOOKUP(P13,Staatenübersicht!$A$9:$E$264,3,FALSE)))*AA13","v":{"$error":"#VALUE!"}},"1","1",{"$f":"IF(+G14,IF(AC13+AD13<2,\"1\",0),1)","v":1},{"$f":"IF($G$11=\"\",\"\",IF(ISNA(VLOOKUP(P13,Staatenübersicht!$A$9:$E$264,3,FALSE))=TRUE,\"Nichtsgefunden\",VLOOKUP(P13,Staatenübersicht!$A$9:$E$264,3,FALSE)))*AE13","v":{"$error":"#VALUE!"}},{"$f":"IF(Q13=\"\",\"\",IF(C13=\"WAHR\",X13+AF13,IF(C14=\"Wahr\",X13+AB13,X13+AB13+AF13)))","v":""},"",null,null,{"$f":"IF($G$11=\"\",\"\",IF(ISNA(VLOOKUP(P13,Staatenübersicht!$A$9:$E$264,5,FALSE))=TRUE,\"0,00 €\",VLOOKUP(P13,Staatenübersicht!$A$9:$E$264,5,FALSE)))","v":""},"0,00 €",null,null,null,null,{"$f":"IF(P13=\"\",\"\",IF(ISNA(VLOOKUP(P13,Staatenübersicht!$A$9:$E$264,2,FALSE))=TRUE,\"Nichtsgefunden\",VLOOKUP(P13,Staatenübersicht!$A$9:$E$264,2,FALSE)))","v":""},"","","","",null,null,0.3,"","0,00 €",null,null,null,null,""]
["WAHR","WAHR","",null,null,null,null,null,null,null,null,null,"",null,null,null,"",null,1440,null,"00:00:00",null,"",{"$f":"IF(P14=\"\",\"\",IF(ISNA(VLOOKUP(P14,Staatenübersicht!$A$9:$E$264,2,FALSE))=TRUE,\"Nichtsgefunden\",VLOOKUP(P14,Staatenübersicht!$A$9:$E$264,2,FALSE)))*W14","v":{"$error":"#VALUE!"}},null,null,"",{"$f":"IF($G$11=\"\",\"\",IF(ISNA(VLOOKUP(P14,Staatenübersicht!$A$9:$E$264,3,FALSE))=TRUE,\"Nichtsgefunden\",VLOOKUP(P14,Staatenübersicht!$A$9:$E$264,3,FALSE)))*AA14","v":{"$error":"#VALUE!"}},"1","1",{"$f":"IF(+G15,IF(AC14+AD14<2,\"1\",0),1)","v":1},{"$f":"IF($G$11=\"\",\"\",IF(ISNA(VLOOKUP(P14,Staatenübersicht!$A$9:$E$264,3,FALSE))=TRUE,\"Nichtsgefunden\",VLOOKUP(P14,Staatenübersicht!$A$9:$E$264,3,FALSE)))*AE14","v":{"$error":"#VALUE!"}},"","",null,null,{"$f":"IF($G$11=\"\",\"\",IF(ISNA(VLOOKUP(P14,Staatenübersicht!$A$9:$E$264,5,FALSE))=TRUE,\"0,00 €\",VLOOKUP(P14,Staatenübersicht!$A$9:$E$264,5,FALSE)))","v":""},"0,00 €",null,null,null,null,{"$f":"IF(P14=\"\",\"\",IF(ISNA(VLOOKUP(P14,Staatenübersicht!$A$9:$E$264,2,FALSE))=TRUE,\"Nichtsgefunden\",VLOOKUP(P14,Staatenübersicht!$A$9:$E$264,2,FALSE)))","v":""},"","","","",null,null,0.3,"","0,00 €",null,null,null,null,""]
["WAHR","WAHR","",null,null,null,null,null,null,null,null,null,"",null,null,null,"",null,1440,null,"00:00:00",null,"",{"$f":"IF(P15=\"\",\"\",IF(ISNA(VLOOKUP(P15,Staatenübersicht!$A$9:$E$264,2,FALSE))=TRUE,\"Nichtsgefunden\",VLOOKUP(P15,Staatenübersicht!$A$9:$E$264,2,FALSE)))*W15","v":{"$error":"#VALUE!"}},null,null,"",{"$f":"IF($G$11=\"\",\"\",IF(ISNA(VLOOKUP(P15,Staatenübersicht!$A$9:$E$264,3,FALSE))=TRUE,\"Nichtsgefunden\",VLOOKUP(P15,Staatenübersicht!$A$9:$E$264,3,FALSE)))*AA15","v":{"$error":"#VALUE!"}},"1","1",1,{"$f":"IF($G$11=\"\",\"\",IF(ISNA(VLOOKUP(P15,Staatenübersicht!$A$9:$E$264,3,FALSE))=TRUE,\"Nichtsgefunden\",VLOOKUP(P15,Staatenübersicht!$A$9:$E$264,3,FALSE)))*AE15","v":{"$error":"#VALUE!"}},"","",null,null,{"$f":"IF($G$11=\"\",\"\",IF(ISNA(VLOOKUP(P15,Staatenübersicht!$A$9:$E$264,5,FALSE))=TRUE,\"0,00 €\",VLOOKUP(P15,Staatenübersicht!$A$9:$E$264,5,FALSE)))","v":""},"0,00 €",null,null,null,null,{"$f":"IF(P15=\"\",\"\",IF(ISNA(VLOOKUP(P15,Staatenübersicht!$A$9:$E$264,2,FALSE))=TRUE,\"Nichtsgefunden\",VLOOKUP(P15,Staatenübersicht!$A$9:$E$264,2,FALSE)))","v":""},"","","","",null,null,0.3,"","0,00 €",null,null,null,null,""]
["WAHR","WAHR","",null,null,null,null,null,null,null,null,null,"",null,null,null,"",null,1440,null,"00:00:00",null,"",{"$f":"IF(P16=\"\",\"\",IF(ISNA(VLOOKUP(P16,Staatenübersicht!$A$9:$E$264,2,FALSE))=TRUE,\"Nichtsgefunden\",VLOOKUP(P16,Staatenübersicht!$A$9:$E$264,2,FALSE)))*W16","v":{"$error":"#VALUE!"}},null,null,"",{"$f":"IF($G$11=\"\",\"\",IF(ISNA(VLOOKUP(P16,Staatenübersicht!$A$9:$E$264,3,FALSE))=TRUE,\"Nichtsgefunden\",VLOOKUP(P16,Staatenübersicht!$A$9:$E$264,3,FALSE)))*AA16","v":{"$error":"#VALUE!"}},"1","1",1,{"$f":"IF($G$11=\"\",\"\",IF(ISNA(VLOOKUP(P16,Staatenübersicht!$A$9:$E$264,3,FALSE))=TRUE,\"Nichtsgefunden\",VLOOKUP(P16,Staatenübersicht!$A$9:$E$264,3,FALSE)))*AE16","v":{"$error":"#VALUE!"}},"","",null,null,{"$f":"IF($G$11=\"\",\"\",IF(ISNA(VLOOKUP(P16,Staatenübersicht!$A$9:$E$264,5,FALSE))=TRUE,\"0,00 €\",VLOOKUP(P16,Staatenübersicht!$A$9:$E$264,5,FALSE)))","v":""},"0,00 €",null,null,null,null,{"$f":"IF(P16=\"\",\"\",IF(ISNA(VLOOKUP(P16,Staatenübersicht!$A$9:$E$264,2,FALSE))=TRUE,\"Nichtsgefunden\",VLOOKUP(P16,Staatenübersicht!$A$9:$E$264,2,FALSE)))","v":""},"","","","",null,null,0.3,"","0,00 €",null,null,null,null,""]
["WAHR","WAHR","",null,null,null,null,null,null,null,null,null,"",null,null,null,"",null,1440,null,"00:00:00",null,"",{"$f":"IF(P17=\"\",\"\",IF(ISNA(VLOOKUP(P17,Staatenübersicht!$A$9:$E$264,2,FALSE))=TRUE,\"Nichtsgefunden\",VLOOKUP(P17,Staatenübersicht!$A$9:$E$264,2,FALSE)))*W17","v":{"$error":"#VALUE!"}},null,null,"",{"$f":"IF($G$11=\"\",\"\",IF(ISNA(VLOOKUP(P17,Staatenübersicht!$A$9:$E$264,3,FALSE))=TRUE,\"Nichtsgefunden\",VLOOKUP(P17,Staatenübersicht!$A$9:$E$264,3,FALSE)))*AA17","v":{"$error":"#VALUE!"}},"1","1",1,{"$f":"IF($G$11=\"\",\"\",IF(ISNA(VLOOKUP(P17,Staatenübersicht!$A$9:$E$264,3,FALSE))=TRUE,\"Nichtsgefunden\",VLOOKUP(P17,Staatenübersicht!$A$9:$E$264,3,FALSE)))*AE17","v":{"$error":"#VALUE!"}},"","",null,null,{"$f":"IF($G$11=\"\",\"\",IF(ISNA(VLOOKUP(P17,Staatenübersicht!$A$9:$E$264,5,FALSE))=TRUE,\"0,00 €\",VLOOKUP(P17,Staatenübersicht!$A$9:$E$264,5,FALSE)))","v":""},"0,00 €",null,null,null,null,{"$f":"IF(P17=\"\",\"\",IF(ISNA(VLOOKUP(P17,Staatenübersicht!$A$9:$E$264,2,FALSE))=TRUE,\"Nichtsgefunden\",VLOOKUP(P17,Staatenübersicht!$A$9:$E$264,2,FALSE)))","v":""},"","","","",null,null,0.3,"","0,00 €",null,null,null,null,""]
["WAHR","WAHR","",null,null,null,null,null,null,null,null,null,"",null,null,null,"",null,1440,null,"00:00:00",null,"",{"$f":"IF(P18=\"\",\"\",IF(ISNA(VLOOKUP(P18,Staatenübersicht!$A$9:$E$264,2,FALSE))=TRUE,\"Nichtsgefunden\",VLOOKUP(P18,Staatenübersicht!$A$9:$E$264,2,FALSE)))*W18","v":{"$error":"#VALUE!"}},null,null,"",{"$f":"IF($G$11=\"\",\"\",IF(ISNA(VLOOKUP(P18,Staatenübersicht!$A$9:$E$264,3,FALSE))=TRUE,\"Nichtsgefunden\",VLOOKUP(P18,Staatenübersicht!$A$9:$E$264,3,FALSE)))*AA18","v":{"$error":"#VALUE!"}},"1","1",1,{"$f":"IF($G$11=\"\",\"\",IF(ISNA(VLOOKUP(P18,Staatenübersicht!$A$9:$E$264,3,FALSE))=TRUE,\"Nichtsgefunden\",VLOOKUP(P18,Staatenübersicht!$A$9:$E$264,3,FALSE)))*AE18","v":{"$error":"#VALUE!"}},"","",null,null,{"$f":"IF($G$11=\"\",\"\",IF(ISNA(VLOOKUP(P18,Staatenübersicht!$A$9:$E$264,5,FALSE))=TRUE,\"0,00 €\",VLOOKUP(P18,Staatenübersicht!$A$9:$E$264,5,FALSE)))","v":""},"0,00 €",null,null,null,null,{"$f":"IF(P18=\"\",\"\",IF(ISNA(VLOOKUP(P18,Staatenübersicht!$A$9:$E$264,2,FALSE))=TRUE,\"Nichtsgefunden\",VLOOKUP(P18,Staatenübersicht!$A$9:$E$264,2,FALSE)))","v":""},"","","","",null,null,0.3,"","0,00 €",null,null,null,null,""]
["WAHR","WAHR","",null,null,null,null,null,null,null,null,null,"",null,null,null,"",null,1440,null,"00:00:00",null,"",{"$f":"IF(P19=\"\",\"\",IF(ISNA(VLOOKUP(P19,Staatenübersicht!$A$9:$E$264,2,FALSE))=TRUE,\"Nichtsgefunden\",VLOOKUP(P19,Staatenübersicht!$A$9:$E$264,2,FALSE)))*W19","v":{"$error":"#VALUE!"}},null,null,"",{"$f":"IF($G$11=\"\",\"\",IF(ISNA(VLOOKUP(P19,Staatenübersicht!$A$9:$E$264,3,FALSE))=TRUE,\"Nichtsgefunden\",VLOOKUP(P19,Staatenübersicht!$A$9:$E$264,3,FALSE)))*AA19","v":{"$error":"#VALUE!"}},"1","1",1,{"$f":"IF($G$11=\"\",\"\",IF(ISNA(VLOOKUP(P19,Staatenübersicht!$A$9:$E$264,3,FALSE))=TRUE,\"Nichtsgefunden\",VLOOKUP(P19,Staatenübersicht!$A$9:$E$264,3,FALSE)))*AE19","v":{"$error":"#VALUE!"}},"","",null,null,{"$f":"IF($G$11=\"\",\"\",IF(ISNA(VLOOKUP(P19,Staatenübersicht!$A$9:$E$264,5,FALSE))=TRUE,\"0,00 €\",VLOOKUP(P19,Staatenübersicht!$A$9:$E$264,5,FALSE)))","v":""},"0,00 €",null,null,null,null,{"$f":"IF(P19=\"\",\"\",IF(ISNA(VLOOKUP(P19,Staatenübersicht!$A$9:$E$264,2,FALSE))=TRUE,\"Nichtsgefunden\",VLOOKUP(P19,Staatenübersicht!$A$9:$E$264,2,FALSE)))","v":""},"","","","",null,null,0.3,"","0,00 €",null,null,null,null,""]
["WAHR","WAHR","",null,null,null,null,null,null,null,null,null,"",null,null,null,"",null,1440,null,"00:00:00",null,"",{"$f":"IF(P20=\"\",\"\",IF(ISNA(VLOOKUP(P20,Staatenübersicht!$A$9:$E$264,2,FALSE))=TRUE,\"Nichtsgefunden\",VLOOKUP(P20,Staatenübersicht!$A$9:$E$264,2,FALSE)))*W20","v":{"$error":"#VALUE!"}},null,null,"",{"$f":"IF($G$11=\"\",\"\",IF(ISNA(VLOOKUP(P20,Staatenübersicht!$A$9:$E$264,3,FALSE))=TRUE,\"Nichtsgefunden\",VLOOKUP(P20,Staatenübersicht!$A$9:$E$264,3,FALSE)))*AA20","v":{"$error":"#VALUE!"}},"1","1",1,{"$f":"IF($G$11=\"\",\"\",IF(ISNA(VLOOKUP(P20,Staatenübersicht!$A$9:$E$264,3,FALSE))=TRUE,\"Nichtsgefunden\",VLOOKUP(P20,Staatenübersicht!$A$9:$E$264,3,FALSE)))*AE20","v":{"$error":"#VALUE!"}},"","",null,null,{"$f":"IF($G$11=\"\",\"\",IF(ISNA(VLOOKUP(P20,Staatenübersicht!$A$9:$E$264,5,FALSE))=TRUE,\"0,00 €\",VLOOKUP(P20,Staatenübersicht!$A$9:$E$264,5,FALSE)))","v":""},"0,00 €",null,null,null,null,{"$f":"IF(P20=\"\",\"\",IF(ISNA(VLOOKUP(P20,Staatenübersicht!$A$9:$E$264,2,FALSE))=TRUE,\"Nichtsgefunden\",VLOOKUP(P20,Staatenübersicht!$A$9:$E$264,2,FALSE)))","v":""},"","","","",null,null,0.3,"","0,00 €",null,null,null,null,""]
{"$rows_left_out":26}
{"sheet":"Staatenübersicht","index":3,"n_rows":264,"n_cols":5,"rows_kept":264,"cut":false,"hidden":true,"merged":[[0,0,7,0],[0,1,0,3],[1,1,1,3],[2,1,2,3]]}
["Land","Pauschbeträge für Verpflegungsmehr-",null,null,"Pauschbetrag"]
[null,"aufwendungen bei einer",null,null,"für Übernach-"]
[null,"Abwesenheitsdauer je Kalendertag von",null,null,"tungskosten"]
[null,"mindestens","weniger als","weniger als"]
[null,"24 Stunden","24, aber","14, aber"]
[null,null,"mindestens","mindestens"]
[null,null,"14 Stunden","8 Stunden"]
[null,"€","€","€","€"]
["Afghanistan",30,20,10,95]
["Ägypten",41,28,10,125]
["Äthiopien",27,18,10,86]
["Äquatorialguinea",36,24,17,166]
["Albanien",29,20,8,113]
["Algerien",51,34,13,173]
["Andorra",34,23,11,45]
["Angola",77,52,26,265]
["Antigua und Barbuda",45,30,14,177]
["Argentinien",34,23,12,144]
["Armenien",23,16,8,63]
["Aserbaidschan",30,20,14,72]
{"$rows_left_out":244}