{"text_format":"1","workbook":"xlsx","n_sheets":7,"sheets":["Version_Prüfung","Erläuterung","Empfehlung","mehrtägig nach Pauschalen","mehrtätig mit Belegen","eintätig nach Pauschalen","Staatenübersicht"],"not_rendered":{"charts":0,"images":2,"macros":1,"external_links":0,"defined_names":10,"comments":2,"pivot_tables":0},"unopened":[],"bounds":{"document_bytes":16777216,"sheet_cells":100000,"rows_first":2000,"rows_last":500,"rows_between":2000,"halvings":0,"cell_chars":16384,"cell_head_chars":4096},"cells_cut":0,"cells_raw":0,"read":"whole","date_system":"1900"}

{"sheet":"Version_Prüfung","index":0,"n_rows":59,"n_cols":3,"rows_kept":59,"cut":false,"hidden":false,"merged":[[2,0,2,3],[7,1,7,3],[9,1,9,6],[11,1,11,5],[47,1,47,3]]}
[]
[]
[]
[]
[]
[null,"Versionshinweis:"]
[]
[null,"Stand Juli 2015 - Version 1.2"]
[]
[null,"Vorliegen einer aktuelleren Version in der NWB Datenbank prüfen."]
[]
[null,"NWB Datenbank DokID: JAAAE-82626"]
[]
[]
[]
[]
[]
[]
[]
[]
[]
[]
[]
[]
[]
[]
[]
[]
[]
[]
[]
[]
[]
[]
[]
[]
[]
[]
[]
[]
[]
[]
[]
[]
[]
[]
[]
[]
[]
[]
[]
[]
[]
[]
[]
[]
[null,null,"Stand Februar 2015"]
[null,null,"Karl-Hermann Eckert"]
[null,null,"Ronny Sebast"]

{"sheet":"Erläuterung","index":1,"n_rows":73,"n_cols":3,"rows_kept":73,"cut":false,"hidden":false,"merged":[[50,2,50,3],[51,2,51,3],[52,2,52,3],[3,0,3,3],[43,1,43,3],[45,2,48,3],[49,2,49,3]]}
[]
[]
[]
[]
[]
[]
["Dieses Excel-Tool besteht aus: "]
[]
[null,"Blatt 1 [Erläuterung]"]
[null,null,"Erläuterungstexte / diese Seite"]
[]
[null,"Blatt 2 [Empfehlung]"]
[null,null,"Arbeitsempfehlung"]
[]
[null,"Blatt 3 [mehrtägig nach Pauschalen - Ansatz der reinen Pauschbeträge]"]
[null,null,"Blatt 3 bietet für den Arbeitgeber die Möglichkeit seine Reisekosten nach den "]
[null,null,"allgemeinen Pauschbeträgen geltend zu machen. Der gesonderten Vorlage "]
[null,null,"von Abrechnungsdokumenten bedarf es nicht. Es ist durch geeignete Meldungen, "]
[null,null,"sicherzustellen, dass neben der Erstattung kein zusätzlicher Werbungskostenabzug"]
[null,null,"geltend gemacht wird. Dies kann zum Beispiel durch Meldungen ans das zuständige"]
[null,null,"Finanzamt oder durch entsprechende Eintragungen auf der elektronischen "]
[null,null,"Lohnsteuerabrechnung erfolgen."]
[]
[null,"Blatt 4 [mehrtägig mit Belegen - ggf. Kürzung der Pauschbeträge]"]
[null,null,"Hinsichtlich der Abrechnung von Auslandsreisekosten mittels Blatt 4 bedarf es der "]
[null,null,"Vorlage von Einzelnachweisen."]
[null,null,"Dies kann der Fall sein, wenn die Unterkunft im Ausland durch den Arbeitgeber"]
[null,null,"auf dessen Namen erfolgte, die Bezahlung vor Ort aber durch den Arbeitnehmer"]
[null,null,"vorgenommen wurde. Wurde dem Arbeitsnehmer neben der Unterkunft auch die  "]
[null,null,"Verpflegung unentgeltlich zur Verfügung gestellt, sind die entsprechenden Beträge"]
[null,null,"für Verpflegungsmehraufwungen entsprechend zu kürzen."]
[]
[]
[null,"Blatt 5 [eintägig nach Pauschalen - ggf. Kürzung der Pauschbeträge]"]
[null,null,"Hinsichtlich der Abrechnung von Auslandsreisekosten mittels Blatt 5 bedarf es der "]
[null,null,"Vorlage von Einzelnachweisen."]
[null,null,"Dies kann der Fall sein, wenn die Kosten für Verköstigung im Ausland durch den Arbeitgeber"]
[null,null,"auf dessen Namen erfolgte, die Bezahlung vor Ort aber durch den Arbeitnehmer"]
[null,null,"vorgenommen wurde. Wurde dem Arbeitsnehmer die"]
[null,null,"Verpflegung unentgeltlich zur Verfügung gestellt, sind die entsprechenden Beträge"]
[null,null,"für Verpflegungsmehraufwungen entsprechend zu kürzen."]
[null,null,"Die Kürzung erfolgt durch Aktivierung der entsprechenden Schaltfläche [¨Kürzung]."]
[]
[null,"Hinweise:"]
[]
[null,null,"Bitte beachten Sie, dass das vorliegende Tool lediglich die Grundsätze der Reisekostenberechnung berücksichtigt. Das bedeutet, dass bei der Ermittlung der Aufwendungen für Verpflegung für die Versteuerung die Sachbezugswerte berücksichtigt werden. Eine Berücksichtigung durch den Arbeitgeber zur Verfügung gestellter Mahlzeiten mit dem Sachbezugswert ist seit dem Jahr 2014 bis zu einem Wert von 60,00 € je \n\n"]
[]
[]
[]
[null,null,"Mahlzeit möglich (bis 2013 bis 40,00 €). "]
[null,null,"Übersteigt der Wert der zur Verfügung gestellten Mahlzeit den Wert von 60,00 € ist der tatsächliche Wert der "]
[null,null,"Mahlzeit als geldwerter Vorteil zu versteuern. Sofern keine Besteuerung der Sachbezugswerte erfolgt, "]
[null,null,"werden die gesetzlichen Pauschbeträge für Verpflegungsmehraufwendungen entsprechend der unentgeltlich "]
[null,null,"zur Verfügung gestellten Mahlzeiten gekürzt."]
[]
[null,null,"Die Grundlagen zur Reform des Reisekostenrechts sind im BMF-Schreiben vom"]
[null,null,"24.10.2014 - IV C 5 - S 2353/14/10002 (NWB DokID: SAAAE-78499) enthalten."]
[]
[null,null,"Die hier hinterlegten Pauschbeträge wurden durch BMF-Schreiben vom 19.12.2014 - IV C 5 - S 2353/08/10006:005"]
[null,null,"(NWB DokID: FAAAE-81998) zur steuerlichen Behandlung von Reisekosten und Reisevergütungen bei betrieblich "]
[null,null,"und beruflich veranlassten Auslandsreisen ab dem 1. Januar 2015 bekannt gegeben."]
[]
[null,null,"Weitere rechtliche Hinweise enthalten die aktuellen Lohnsteuer-Richtlinien (LStR) "]
[null,null,"bzw. Lohnsteuer-Hinweise (LStH)."]
[]
[null,null,"Die Eingabe des Wertes \"Datum\" muss mit \"PUNKT\" zu erfolgen."]
[null,null,"Die Eingabe des Wertes \"Uhrzeit\" muss mit \"DOPPELPUNKT\" zu erfolgen."]
[null,null,"Nur in hellen Feldern können Eingaben erfolgen."]
[]
[]
[null,null,"Stand Juli 2015"]
[null,null,"Karl-Hermann Eckert"]
[null,null,"Ronny Sebast"]

{"sheet":"Empfehlung","index":2,"n_rows":21,"n_cols":3,"rows_kept":21,"cut":false,"hidden":false,"merged":[[20,2,21,3],[15,2,19,3],[0,0,0,3],[1,0,1,3],[6,1,6,3],[11,2,12,3]]}
[]
[]
[]
[]
[]
[]
[null,"Es wird vorgeschlagen in dieser Excel-Mappe keine Einträge vorzunehmen."]
[]
[]
[null,"Die Empfehlung lautet:"]
[]
[null,"*","Kopieren Sie diese Excel-Mappe unter einen neuen Namen über den Befehl \"Speichern unter\" (z. B.: \"Reisekosten\") auf Ihre Festplatte. "]
[]
[]
[]
[null,"*","Zur Senkung Ihrer Druckkosten sind alle Tabellenblätter als Schwarzweiss-Druck hinterlegt. Wünschen Sie den\nAusdruck in Farbe, gelangen Sie über die Menüleiste unter Datei => Seite einrichten zu den entsprechenden Optionen. Entfernen Sie dort in der Registerkarte Tabelle unter Schwarzweißdruck das entsprechende Häkchen. "]
[]
[]
[]
[]
[null,"*","Weiterhin wird das Auswahlmenü für die verschiedenen Länder automatisch vergrößert, wenn das entsprechende Auswahlfeld markiert wird. Durch Auswahl eines anderen hellmarkierten Feldes wird die ursprüngliche Darstellung wieder hergestellt."]

{"sheet":"mehrtägig nach Pauschalen","index":3,"n_rows":71,"n_cols":14,"rows_kept":71,"cut":false,"hidden":false,"merged":[[59,1,59,4],[16,2,16,9],[17,2,17,9],[21,2,21,5],[51,2,51,4],[16,1,17,1],[57,1,57,4],[3,2,3,9],[8,2,8,3],[11,2,11,3],[13,2,13,3],[5,2,5,9]]}
[]
[]
[]
[null,"Name des Reisenden:"]
[]
[null,"Reiseland"]
[]
[]
[null,null,"Datum",null,null,"Uhrzeit",null,"Reisedauer"]
[]
[]
[null,"Abfahrt",null,null,null,null,null,null,"Gesamtdauer in Tage",{"$f":"IF(C12=\"\",\"\",SUM(C14-C12+1))","v":""},null,null,null," "]
[null,null,null,null,null,null,null,null,null,null,null,null,null," "]
[null,"Rückkehr",null,null,null,null,null,null,null,null,null,null,null," "]
[]
[]
[null,"Grund und Ort der Reise"]
[]
[]
[]
[]
[null,null,"Reisekosten - Abrechnung",null,null,null,null,null,null,"Euro",null,"Konto"]
[]
[]
[null,"Pauschale für Mehraufwand für Verpflegung"]
[]
[null,"volle Reisetage = Tagessatz",null,{"$f":"IF(C6=\"\",\"\",(J12-2))","v":""},"Tag/e","zu",{"$f":"IF(C6=\"\",\"\",IF(ISNA(VLOOKUP(C6,Staatenübersicht!A9:E262,2,FALSE)) = TRUE, \"Nichtsgefunden\", VLOOKUP(C6,Staatenübersicht!A9:E262,2,FALSE)))","v":""},{"$f":"IF(C12=\"\",\"0,00 €\",(D27*G27))","v":"0,00 €"}]
[]
[null,"erster Reisetag",null,{"$f":"IF(C6=\"\",\"\",1)","v":""},"Tag/e","zu",{"$f":"IF(C6=\"\",\"\",IF(ISNA(VLOOKUP(C6,Staatenübersicht!A9:E262,3,FALSE)) = TRUE, \"Nichtsgefunden\", VLOOKUP(C6,Staatenübersicht!A9:E262,3,FALSE)))","v":""},{"$f":"IF(C12=\"\",\"0,00 €\",D29*G29)","v":"0,00 €"}]
[]
[null,"letzter Reisetag",null,{"$f":"IF(C6=\"\",\"\",1)","v":""},"Tag/e","zu ",{"$f":"IF(C6=\"\",\"\",IF(ISNA(VLOOKUP(C6,Staatenübersicht!A9:E262,3,FALSE)) = TRUE, \"Nichtsgefunden\", VLOOKUP(C6,Staatenübersicht!A9:E262,3,FALSE)))","v":""},{"$f":"IF(C12=\"\",\"0,00 €\",+D31*G31)","v":"0,00 €"}]
[null,null,null,null,null,null,null,null,null,{"$f":"IF(J12<\"0\",SUM(H27+H29+H31),\"0,00 €\")","v":0}]
[]
[]
[]
[null,"Übernachtungskosten (Pauschale nur für Arbeitnehmer)"]
[]
[null,"Pauschale für Arbeitnehmer bei Erstattung durch Arbeitgeber",null,null,"Tag/e","zu ",{"$f":"IF(C6=\"\",\"\",IF(ISNA(VLOOKUP(C6,Staatenübersicht!A9:E262,5,FALSE)) = TRUE, \"Nichtsgefunden\", VLOOKUP(C6,Staatenübersicht!A9:E262,5,FALSE)))","v":""},{"$f":"IF(D38=\"\",\"\",+D38*G38)","v":""},null,{"$f":"+H38","v":""}]
[]
[]
[]
[null,"Beförderungskosten"]
[]
[null,"mit eigenem Fahrzeug",null,null,"km","zu ",0.3,{"$f":"+D44*G44","v":0}]
[]
[null,"mit Bahn ",null,null,null,null,"lt. Einzelnachweis"]
[null,null,null,null,null,null,null," "]
[null,"mit Taxi ",null,null,null,null,"lt. Einzelnachweis"]
[]
[null,"mit Flugzeug",null,null,null,null,"lt. Einzelnachweis"]
[]
[null,"sonstiges",null,null,null,null,"lt. Einzelnachweis",null,null,{"$f":"+H44+H46+H48+H50+H52","v":0}]
[]
[]
[]
[null,"sonstige Aufwendungen"]
[]
[null,null,null,null,null,null,"lt. Einzelnachweis"]
[null,null," "]
[null,null,null,null,null,null,"lt. Einzelnachweis",null,null,{"$f":"+H58+H60","v":0}]
[]
[]
[]
[]
[null,"gesamte Reisekosten",null,null,null,null,null,"Summe",null,{"$f":"SUM(J25:J62)","v":0}]
[]
[]
[null,"Anmerkung:","Die Eingabe des Wertes \"Datum\" muss mit \"PUNKT\" zu erfolgen."]
[null,null,"Die Eingabe des Wertes \"Uhrzeit\" muss mit \"DOPPELPUNKT\" zu erfolgen."]
[]
[null,null,"Nur in den hellen Felder können Eingaben erfolgen."]

{"sheet":"mehrtätig mit Belegen","index":4,"n_rows":123,"n_cols":20,"rows_kept":123,"cut":false,"hidden":false,"merged":[[3,3,3,10],[8,3,8,4],[11,3,11,4],[13,3,13,4],[5,3,5,10],[111,2,111,5],[16,3,16,10],[17,3,17,10],[21,3,21,6],[56,3,56,5],[16,2,17,2],[35,2,35,8],[68,2,68,8],[103,2,103,8],[62,2,62,5],[64,2,64,5]]}
[]
[]
[]
[null,null,"Name des Reisenden:"]
[]
[null,null,"Reiseland"]
[]
[]
[null,null,null,"Datum",null,null,"Uhrzeit",null,"Reisedauer"]
[]
[]
[null,null,"Abfahrt",null,null,null,null,null,null,"Gesamtdauer in Tage",{"$f":"IF(D12=\"\",\"\",SUM(D14-D12+1))","v":""},null,null,null," "]
[null,null,null,null,null,null,null,null,null,null,null,null,null,null," "]
[null,null,"Rückkehr",null,null,null,null,null,null,null,null,null,null,null," "]
[]
[]
[null,null,"Grund und Ort der Reise"]
[]
[]
[]
[]
[null,null,null,"Reisekosten - Abrechnung",null,null,null,null,null,null,"Euro",null,"Konto"]
[]
[]
[null,null,"Pauschale für Mehraufwand für Verpflegung"]
[]
[null,null,"volle Reisetage = Tagessatz","24 Stunden ",{"$f":"IF(D6=\"\",\"\",(K12-2))","v":""},"Tag/e","zu",{"$f":"IF(D6=\"\",\"\",IF(ISNA(VLOOKUP(D6,Staatenübersicht!A9:E262,2,FALSE)) = TRUE, \"Nichtsgefunden\", VLOOKUP(D6,Staatenübersicht!A9:E262,2,FALSE)))","v":""},{"$f":"IF(D12=\"\",\"0,00 €\",(E27*H27))","v":"0,00 €"}]
[]
[null,null,"erster Reisetag",null,{"$f":"IF(D6=\"\",\"\",1)","v":""},"Tag/e","zu",{"$f":"IF(D6=\"\",\"\",IF(ISNA(VLOOKUP(D6,Staatenübersicht!A9:E262,4,FALSE)) = TRUE, \"Nichtsgefunden\", VLOOKUP(D6,Staatenübersicht!A9:E262,3,FALSE)))","v":""},{"$f":"IF(D12=\"\",\"0,00 €\",E29*H29)","v":"0,00 €"}]
[]
[null,null,"letzter Reisetag",null,{"$f":"IF(D6=\"\",\"\",1)","v":""},"Tag/e","zu ",{"$f":"IF(D6=\"\",\"\",IF(ISNA(VLOOKUP(D6,Staatenübersicht!A9:E262,3,FALSE)) = TRUE, \"Nichtsgefunden\", VLOOKUP(D6,Staatenübersicht!A9:E262,3,FALSE)))","v":""},{"$f":"IF(D12=\"\",\"0,00 €\",+E31*H31)","v":"0,00 €"}]
[null,null,null,null,null,null,null,null,null,null,{"$f":"IF(K12<\"0\",SUM(I27+I29+I31),\"0,00 €\")","v":0}]
[]
[]
[]
[null,null,"Übernachtungskosten "]
[]
[null,null,"Übernachtung mit Frühstück (nicht gesondert ausgewiesen)",null,null,"Tag/e","zu",null,{"$f":"+E38*H38","v":0}]
[]
[null,null,"Übernachtung mit Frühstück (Wert ohne Frühstück) ",null,null,"Tag/e","zu ",null,{"$f":"+E40*H40","v":0}]
[null,null,"zuzüglich Frühstück - Frühstück gesondert ausgewiesen -",null,{"$f":"+E40","v":0},"Tag/e","zu ",null,{"$f":"+E41*H41","v":0}]
[]
[null,null,"Übernachtung ohne Frühstück",null,null,"Tag/e","zu ",null,{"$f":"+E43*H43","v":0},null,{"$f":"SUM(I38:I43)","v":0}]
[]
[]
[]
[null,null,"Beförderungskosten"]
[]
[null,null,"mit eigenem Fahrzeug",null,null,"km","zu ",0.3,{"$f":"+E49*H49","v":0}]
[]
[null,null,"mit Bahn ",null,null,null,null,"lt. Einzelnachweis"]
[null,null,null,null,null,null,null,null," "]
[null,null,"mit Taxi ",null,null,null,null,"lt. Einzelnachweis"]
[]
[null,null,"mit Flugzeug",null,null,null,null,"lt. Einzelnachweis"]
[]
[null,null,"sonstiges",null,null,null,null,"lt. Einzelnachweis",null,null,{"$f":"+I49+I51+I53+I55+I57","v":0}]
[]
[]
[]
[null,null,"sonstige Aufwendungen"]
[]
[null,null,null,null,null,null,null,"lt. Einzelnachweis"]
[null,null,null," "]
[null,null," ",null,null,null,null,"lt. Einzelnachweis",null,null,{"$f":"+I63+I65","v":0}]
[]
[]
[]
[null,null,"Kürzung wegen unentgeltlich zur Verfügung gestellter Mahlzeiten"]
[]
[null,null,"Werte auf Rechnung nicht offen ausgewiesen"]
[]
[]
[null,null,"Anreisetag"]
[null,null,"für Frühstück ",null,null,null,"Zuzahlung",null,{"$f":"MAX(S75-H75,MIN(0))","v":0},null,null,null,null,null,null,false,{"$f":"H27*20%","v":{"$error":"#VALUE!"}},null,{"$f":"IF(P75=TRUE,Q75,\"0,00 €\")","v":"0,00 €"}]
[null,null,"für Mittagessen",null,null,null,"Zuzahlung",null,{"$f":"MAX(S76-H76,MIN(0))","v":0},null,null,null,null,null,null,false,{"$f":"H27*40%","v":{"$error":"#VALUE!"}},null,{"$f":"IF(P76=TRUE,Q76,\"0,00 €\")","v":"0,00 €"}]
[null,null,"für Abendessen",null,null,null,"Zuzahlung",null,{"$f":"MAX(S77-H77,MIN(0))","v":0},null,{"$f":"-T78","v":0},null,null,null,null,false,{"$f":"H27*40%","v":{"$error":"#VALUE!"}},null,{"$f":"IF(P77=TRUE,Q77,\"0,00 €\")","v":"0,00 €"}]
[null,null,null,null,null,null,null,null,null,null,null,null,null,null,null,null,null,null,{"$f":"SUM(S75:S77)","v":0},{"$f":"MIN(I75+I76+I77,MAX(H29))","v":0}]
[null,null,"Aufenthalt"]
[null,null,"für Frühstück bei Übernachtung",0.2,null,"Tage","zu ",{"$f":"IF(E80=0,\"\",+H27*D80)","v":""},{"$f":"IF(E80=0,\"0,00 €\",+E80*H80)","v":"0,00 €"},null,null,null,null,null,null,"Frühstuck",{"$f":"IF(Q107=FALSE,MAX(I80-I85,MIN(0)),MAX(I80-I85-I106,MIN(0)))","v":0},null,"muss minus sein!!!"]
{"$rows_left_out":44}
{"sheet":"eintätig nach Pauschalen","index":5,"n_rows":83,"n_cols":18,"rows_kept":83,"cut":false,"hidden":false,"merged":[[16,1,17,1],[32,1,32,7],[16,2,16,9],[54,2,54,4],[3,2,3,9],[8,2,8,3],[11,2,11,3],[13,2,13,3],[5,2,5,9],[17,2,17,9],[21,2,21,5],[65,1,65,7],[34,4,34,5],[34,6,34,7],[36,6,36,7],[37,6,37,7],[35,6,35,7],[60,1,60,4],[62,1,62,4]]}
[]
[]
[]
[null,"Name des Reisenden:"]
[]
[null,"Reiseland"]
[]
[]
[null,null,"Datum",null,null,"Uhrzeit",null,"Reisedauer"]
[]
[]
[null,"Abfahrt",null,null,null,null,null,null,"Gesamtdauer in Stunden",{"$f":"IF(F14=\"\",\"\",F14-F12)","v":""},null,null,null," "]
[null,null,null,null,null,null,null,null,null,null,null,null,null," "]
[null,"Rückkehr",{"$f":"IF(C12=\"\",\"\",C12)","v":""},null,null,null,null,null,null,null,null,null,null," "]
[]
[]
[null,"Grund und Ort der Reise"]
[]
[]
[]
[]
[null,null,"Reisekosten - Abrechnung",null,null,null,null,null,null,"Euro",null,"Konto"]
[]
[]
[null,"Pauschale für Mehraufwand für Verpflegung"]
[]
[]
[null,"Reisedauer","mehr als 8 Stunden",{"$f":"IF(J12=\"\",\"0\",IF(J12>0.33334,1,\"0\"))","v":"0"},null,"zu ",{"$f":"IF(C6=\"\",\"\",IF(ISNA(VLOOKUP(C6,Staatenübersicht!A9:E262,3,FALSE)) = TRUE, \"Nichtsgefunden\", VLOOKUP(C6,Staatenübersicht!A9:E262,3,FALSE)))","v":""},{"$f":"IF(C12=\"\",\"0,00 €\",D28*G28)","v":"0,00 €"}]
[null,null,null,null,null,null,null,null,null,{"$f":"IF(C12<>\"\",SUM(H28*D28),\"0,00 €\")","v":"0,00 €"}]
[{"$f":"IF(D4=\"\",\"\",IF(+K12<0.6667,1,0))","v":""}]
[]
[]
[null,"Kürzung wegen Verköstigung durch den Arbeitgeber (entsprechende Mahlzeit durch Häckchen markieren)"]
[]
[null,null,null,null,"Kürzungsbetrag",null,"Zuzahlung des AN"]
[null,"für Frühstück ",0.2,null,null,{"$f":"IF(R36=TRUE,Q36,\"0,00 €\")","v":"0,00 €"},null,null,null,null,null,null,null,{"$f":"IF(Q66=\"Wahr\",H68,\"0,00\")","v":"0,00"},{"$f":"MAX(F36-G36,\"0,00 €\")","v":0},{"$f":"IF(C6=\"\",\"\",IF(ISNA(VLOOKUP(C6,Staatenübersicht!A9:E262,2,FALSE)) = TRUE, \"Nichtsgefunden\", VLOOKUP(C6,Staatenübersicht!A9:E262,2,FALSE)))","v":""},{"$f":"P36*C36","v":{"$error":"#VALUE!"}},false]
[null,"für Mittagessen",0.4,null,null,{"$f":"IF(R37=TRUE,Q37,\"0,00 €\")","v":"0,00 €"},null,null,null,null,null,null,null,{"$f":"IF(Q66=\"Wahr\",+H69,\"0,00\")","v":"0,00"},{"$f":"MAX(F37-G37,\"0,00 €\")","v":0},{"$f":"IF(C6=\"\",\"\",IF(ISNA(VLOOKUP(C6,Staatenübersicht!A9:E262,2,FALSE)) = TRUE, \"Nichtsgefunden\", VLOOKUP(C6,Staatenübersicht!A9:E262,2,FALSE)))","v":""},{"$f":"P37*C37","v":{"$error":"#VALUE!"}},false]
[null,"für Abendessen",0.4,null,null,{"$f":"IF(R38=TRUE,Q38,\"0,00 €\")","v":"0,00 €"},null,null,null,{"$f":"MIN(-Q47,MAX(0))","v":0},null,null,null,{"$f":"IF(Q66=\"Falsch\",H70,\"0,00\")","v":"0,00"},{"$f":"MAX(F38-G38,\"0,00 €\")","v":0},{"$f":"IF(C6=\"\",\"\",IF(ISNA(VLOOKUP(C6,Staatenübersicht!A9:E262,2,FALSE)) = TRUE, \"Nichtsgefunden\", VLOOKUP(C6,Staatenübersicht!A9:E262,2,FALSE)))","v":""},{"$f":"P38*C38","v":{"$error":"#VALUE!"}},false]
[]
[null,null,null,null,null,null,null,null,null,null,null,null,null,"1.Bedingung","2.Bedingung","Summe"]
[null,{"$f":"IF(Q66=FALSE,\"\",\"Die Kürzungsbeträge werden um die verrechneten Sachbezugswerte gemindert\")","v":""},null,null,null,null,null,null,null,{"$f":"IF(B41=\"\",\"\",H72)","v":""},null,null,null,{"$f":"IF(Q66=TRUE,1,0)","v":0},{"$f":"IF(J38<0,1)","v":false},{"$f":"N41+O41","v":0}]
[]
[null,null,null,null,null,null,null,null,null,null,{"$f":"-H43","v":0}]
[]
[null,"Beförderungskosten"]
[]
[null,"mit eigenem Fahrzeug",null,null,"km","zu ",0.3,{"$f":"+D47*G47","v":0},null,null,null,null,null,null,null,{"$f":"IF(Q66=FALSE,(O36+O37+O38),(O36+O37+O38))","v":0},{"$f":"MIN(P47,MAX(H28))","v":0}]
[]
[null,"mit Bahn ",null,null,null,null,"lt. Einzelnachweis"]
[null,null,null,null,null,null,null," "]
[null,"mit Taxi ",null,null,null,null,"lt. Einzelnachweis"]
[]
[null,"mit Flugzeug",null,null,null,null,"lt. Einzelnachweis"]
[]
[null,"sonstiges",null,null,null,null,"lt. Einzelnachweis",null,null,{"$f":"+H47+H49+H51+H53+H55","v":0}]
[]
[]
[]
[null,"sonstige Aufwendungen"]
[]
[null,null,null,null,null,null,"lt. Einzelnachweis"]
[null,null," "]
[null,null,null,null,null,null,"lt. Einzelnachweis",null,null,{"$f":"+H61+H63","v":0}]
[]
[]
[null,"Geldwerter Vorteil (nur für Arbeitnehmer) - Ist Verrechnung mit den Reisekosten erwünscht?  ►",null,null,null,null,null,null,null,null,null,null,null,null,null,null,false]
[]
[null,"für Frühstück",null,null,null,null,1.63,{"$f":"IF(Q68=TRUE,1.63,\"0,00 €\")","v":"0,00 €"},null,null,null,null,null,null,null,null,false]
[null,"für Mittagessen",null,null,null,null,3,{"$f":"IF(Q69=TRUE,3,\"0,00 €\")","v":"0,00 €"},null,null,null,null,null,null,null,null,false]
[null,"für Abendessen",null,null,null,null,3,{"$f":"IF(Q70=TRUE,3,\"0,00 €\")","v":"0,00 €"},null,null,null,null,null,null,null,null,false]
[]
[null,"Summe Geldwerter Vorteil"," ",null,null,null,null,{"$f":"SUM(H68:H70)","v":0},null,{"$f":"IF(Q66=FALSE,\"\",-H72)","v":""}]
[]
[null,null,null,null,null,null,null,null,null,{"$f":"SUM(J24:J73)","v":0}]
[null,"gesamte Reisekosten",null,null,null,null,null,"Summe",null,{"$f":"MAX(J74,MIN(0))","v":0}]
[]
[]
[null,"Anmerkung:","Die Eingabe des Wertes \"Datum\" muss mit \"PUNKT\" zu erfolgen."]
[null,null,"Die Eingabe des Wertes \"Uhrzeit\" muss mit \"DOPPELPUNKT\" zu erfolgen."]
[]
{"$rows_left_out":4}
{"sheet":"Staatenübersicht","index":6,"n_rows":261,"n_cols":5,"rows_kept":261,"cut":false,"hidden":true,"merged":[[0,0,7,0],[0,1,0,3],[1,1,1,3],[2,1,2,3]]}
["Land","Pauschbeträge für Verpflegungsmehr-",null,null,"Pauschbetrag"]
[null,"aufwendungen bei einer",null,null,"für Übernach-"]
[null,"Abwesenheitsdauer je Kalendertag von",null,null,"tungskosten"]
[null,"mindestens","weniger als","weniger als"]
[null,"24 Stunden","24, aber","14, aber"]
[null,null,"mindestens","mindestens"]
[null,null,"14 Stunden","8 Stunden"]
[null,"€","€","€","€"]
["Afghanistan",30,20,10,95]
["Ägypten",40,27,10,113]
["Äthiopien",27,18,10,86]
["Äquatorialguinea",50,33,17,226]
["Albanien",23,16,8,110]
["Algerien",39,26,13,190]
["Andorra",32,21,11,82]
["Angola",77,52,26,265]
["Antigua und Barbuda",53,36,14,117]
["Argentinien",34,23,12,144]
["Armenien",23,16,8,63]
["Aserbaidschan",40,27,14,120]
["Australien"]
["– Canberra",58,39,20,158]
["– Sydney",59,40,20,186]
["– im Übrigen",56,37,19,133]
["Bahrain",36,24,12,70]
["Bangladesch",30,20,10,111]
["Barbados",58,39,14,179]
["Belgien",41,28,14,135]
["Benin",40,27,14,101]
["Bolivien",24,16,8,70]
["Bosnien und Herzegowina",18,12,8,73]
["Botsuana",33,22,11,105]
["Brasilien"]
["– Brasilien Region Brasilia",53,36,18,160]
["– Brasilien Region Rio de Janeiro",47,32,16,145]
["– Brasilien Region Sao Paulo",53,36,18,120]
["– Brasilien im Übrigen",54,36,18,110]
["Brunei",48,32,12,106]
["Bulgarien",22,15,8,90]
["Burkina Faso",44,29,12,84]
["Burundi",47,32,16,98]
["Chile",40,27,14,130]
["China"]
["– China Region Chengdu",32,21,11,85]
["– China Region Hongkong",62,41,21,170]
["– China Region Peking",39,26,13,115]
["– China Region Shanghai",42,28,14,140]
["– China im Übrigen",33,22,11,80]
["Costa Rica",36,24,11,69]
["Côte d’Ivoire",51,34,18,146]
["Dänemark",60,40,20,150]
["Deutschland",24,12,6,20]
["Dominica",40,27,12,94]
["Dominikanische Republik",40,27,10,71]
["Dschibuti",48,32,16,160]
["Ecuador",39,26,13,55]
["El Salvador",46,31,16,75]
["Eritrea",30,20,10,58]
["Estland",27,18,9,71]
["Fidschi",32,21,11,57]
["Finnland",39,26,13,136]
["Frankreich"]
["– Frankreich Region Paris",58,39,20,135]
["– Frankreich Lyon",53,36,18,83]
["– Frankreich Region Marseille",51,34,17,86]
["– Frankreich Region Straßburg",48,32,16,89]
["– Frankreich im Übrigen",44,29,15,81]
["Gabun",62,41,20,278]
["Gambia",18,12,6,70]
["Georgien",30,20,10,80]
["Ghana",46,31,13,174]
["Grenada",51,34,12,121]
["Griechenland"]
["– Griechenland Region Athen",57,38,19,125]
["– Griechenland im Übrigen",42,28,14,132]
["Guatemala",28,19,11,96]
["Guinea",38,25,13,110]
["Guinea-Bissau",30,20,10,60]
["Guyana",41,28,12,81]
["Haiti",50,33,17,111]
{"$rows_left_out":181}